kulturhistoriska byggnader
type: Concept
preferred label: cultural historical buildings @en
preferred label: kulttuurihistorialliset rakennukset @fi
narrower: Töllinmäki

Töllinmäki
type: Concept
broader: kulturhistoriska byggnader
comment: F. E. Sillanpään nuoruudenkoti ja esikoisteoksen syntypaikka Hämeenkyrössä
in scheme: conceptscheme