skatt
type: Concept
preferred label: tax @en
preferred label: vero @fi
narrower: fordonsskatt

konsumtionsskatt
type: Concept
preferred label: consumption taxation @en
preferred label: kulutusverotus @fi
related: fordonsskatt

fordonsskatt
type: Concept
scope note: Tarkoittaa vuonna 1994 käyttöönotettua auton käyttövaiheeseen liittyvää kulutusveroa, joka koskee lähinnä henkilö- ja pakettiautoja
broader: skatt
related: konsumtionsskatt
preferred label: vehicle tax @en
preferred label: ajoneuvovero @fi
in scheme: conceptscheme