skatt
type: Concept
preferred label: tax @en
preferred label: vero @fi
narrower: motorfordonsskatt

konsumtionsskatt
type: Concept
preferred label: consumption taxation @en
preferred label: kulutusverotus @fi
related: motorfordonsskatt

motorfordonsskatt
type: Concept
broader: skatt
preferred label: motor vehicle tax @en
preferred label: moottoriajoneuvovero @fi
scope note: Tarkoittaa auton käyttövaiheeseen liittyvää kulutusveroa, joka koskee muuta polttoainetta kuin bensiiniä käyttäviä moottoriajoneuvoja
related: konsumtionsskatt
in scheme: conceptscheme
source: Lähde: Encyclopaedia iuridica Fennica. 5
alternative label: dieselvero @fi
alternative label: dieselskatt