recent history
type: Concept
broader: history
scope note: Tarkoittaa historiantutkimuksen osa-aluetta
in scheme: conceptscheme
preferred label: lähihistoria @fi
preferred label: närhistoria @sv

history
type: Concept
preferred label: historia @sv
narrower: recent history