muodonvaihdos
type: Concept
preferred label: metamorfos -- biologi @sv
preferred label: metamorphosis @en
related: metamorfoosi

metamorfoosi
type: Concept
source: Suomen kielen perussanakirja
alternative label: muodonmuutos
comment: 1) tarina joka kertoo ihmisen muuttumisesta tav. eläimeksi tai kasviksi; 2) (geol.) kivilajien muuttuminen kivimassojen liikkeen, paineen tai lämpötilan vaikutuksesta; 3) (el.) muodonvaihdos; 4) (kasv.) muuntuminen
preferred label: metamorphosis @en
preferred label: metamorfos @sv
related: muodonvaihdos
broader: muutos
in scheme: conceptscheme

muutos
type: Concept
preferred label: change @en
preferred label: förändring @sv
narrower: metamorfoosi