lantdagsmän
type: Concept
broader: förtroendevalda
scope note: Käytetään vain historiallisessa yhteydessä, muissa tapauksissa käytä kansanedustajat
scope note: Används enbart i historisk betydelse, i övriga fall används termen riksdagsmän
in scheme: conceptscheme
preferred label: delegates to the parliament @en
preferred label: valtiopäivämiehet @fi
related: riksdagsmän

förtroendevalda
type: Concept
preferred label: elected officials @en
preferred label: luottamushenkilöt @fi
narrower: lantdagsmän

riksdagsmän
type: Concept
preferred label: members of parliament @en
preferred label: kansanedustajat @fi
related: lantdagsmän