battles
type: Concept
preferred label: strider @sv
preferred label: taistelut @fi
narrower: Battle of Poltava

Great Northern War
type: Concept
preferred label: stora nordiska kriget @sv
preferred label: suuri Pohjan sota @fi
related: Battle of Poltava

Battle of Poltava
type: Concept
preferred label: slaget vid Poltava @sv
preferred label: Pultavan taistelu @fi
scope note: Suuren Pohjan sodan ratkaiseva taistelu, jossa venäläiset voittivat Kaarle XII:n joukot vuonna 1709
in scheme: conceptscheme
broader: battles
related: Great Northern War
part of: Great Northern War