tietotalous
type: Concept
related: uusi talous

talous (taloudelliset ilmiöt)
type: Concept
preferred label: economy @en
preferred label: ekonomi @sv
narrower: uusi talous

uusi talous
type: Concept
alternative label: verkkotalous
alternative label: digitaalitalous
related: tietotalous
broader: talous (taloudelliset ilmiöt)
preferred label: new economy @en
preferred label: digitalekonomi @sv
source: Lähde: Pohjola, Matti. Uusi talous - tarua vai totta (Kansantaloudellinen aikakauskirja 1/2001)
in scheme: conceptscheme
scope note: Tarkoittaa sekä liiketoimintojen globaalistumista että tietotekniikan vallankumousta. Uusi talous voi tarkoittaa myös aineetonta taloutta