parts of the body
type: Concept
preferred label: kroppsdelar @sv
preferred label: ruumiinosat @fi
narrower: elbows

elbows
type: Concept
in scheme: conceptscheme
preferred label: armbågarna @sv
preferred label: kyynärpäät @fi
broader: parts of the body
part of: hands
source: MOT Lääketiede 2.0a
comment: olkavarren ja kyynärvarren muutaman senttimetrin pituinen liittymäalue

hands
type: Concept
preferred label: händerna @sv
preferred label: kädet @fi