social services
type: Concept
preferred label: social service @sv
preferred label: sosiaalipalvelut @fi
narrower: support of kinship care

support of kinship care
type: Concept
broader: social services
scope note: Tarkoittaa vanhuksen, vammaisen tai sairaan henkilön kotona tapahtuvan hoidon tai muun huolenpidon turvaamiseksi annettavaa hoitopalkkiota ja palveluja. Tuki on sosiaalihuoltolain mukaista sosiaalipalvelua, jonka järjestämisvastuu on kunnalla
in scheme: conceptscheme
preferred label: stöd för anhörigvård @sv
preferred label: omaishoidon tuki @fi