effects
type: Concept
preferred label: vaikutukset @fi
preferred label: effekter @sv
related: consequences

consequences
type: Concept
broader: other role
preferred label: seuraukset @fi
preferred label: följder @sv
comment: 1) se (us. kielteinen seikka), mikä jstak seuraa, johtuu, aiheutuu; 2) (fil.) päätelmä joka loogisesti seuraa tietyistä premisseistä
source: Kielitoimiston sanakirja
in scheme: conceptscheme
related: effects

other role
type: Concept
preferred label: muu rooli @fi
preferred label: annan roll @sv
narrower: consequences