Paasitorni
type: Concept
broader: byggnader
scope note: Helsingin työväenyhdistyksen talo Hakaniemessä
in scheme: conceptscheme

byggnader
type: Concept
preferred label: buildings @en
preferred label: rakennukset @fi
narrower: Paasitorni