miljöns tillstånd
type: Concept
preferred label: state of the environment @en
preferred label: ympäristön tila @fi
related: bioindikatorer

miljöindikatorer
type: Concept
preferred label: ympäristöindikaattorit @fi
preferred label: environmental indicators @en
narrower: bioindikatorer

bioindikatorer
type: Concept
in scheme: conceptscheme
comment: laji, jonka yksilöiden tai populaatioiden ominaisuudet ilmaisevat muutoksia ympäristön tilassa
source: Ympäristösanasto TSK 27
preferred label: bioindicators @en
preferred label: bioindikaattorit @fi
broader: miljöindikatorer
related: miljöns tillstånd