illnesses
type: Concept
preferred label: taudit @fi
preferred label: sjukdomar @sv
narrower: Salla disease

Salla disease
type: Concept
broader: illnesses
source: Lähde: Lääketieteen termit
scope note: Suomalaiseen tautiperintöön kuuluva peittyvästi periytyvä oireyhtymä, jolle on ominaista mm. älyllinen kehitysvammaisuus
alternative label: sialic acid storage disease
in scheme: conceptscheme
preferred label: Sallan tauti @fi