specialdomstolar
type: Concept
preferred label: erikoistuomioistuimet @fi
preferred label: special courts @en
narrower: krigsdomstolar

krigsdomstolar
type: Concept
alternative label: fältdomstolar
alternative label: kenttäoikeudet @fi
preferred label: military courts @en
preferred label: sotatuomioistuimet @fi
in scheme: conceptscheme
scope note: Rauhanajan sotatuomioistuimet lakkautettiin Suomessa v. 1983, ja sotilasrikoksia koskevat syytteet käsitellään yleisissä tuomioistuimissa
scope note: Krigsdomstolarna lades ner i Finland 1983 och militära brott har därefter behandlats inom det ordinära domstolsväsendet.
broader: specialdomstolar