revir
type: Concept
comment: eläimen tai eläinryhmän puolustama elinpiirin osa, jonne ne eivät salli muiden saman lajin yksilöiden tai pesintäreviireissä saman sukupuolen yksilöiden asettua
broader: utbredningsområden
source: Biologian sanakirja
preferred label: reviirit @fi
preferred label: territories @en
in scheme: conceptscheme

utbredningsområden
type: Concept
preferred label: elinpiirit @fi
preferred label: territories @en
narrower: revir