international treaties
type: Concept
narrower: Agenda 21
preferred label: internationella överenskommelser @sv
preferred label: kansainväliset sopimukset @fi

Agenda 21
type: Concept
broader: international treaties
in scheme: conceptscheme
related: Local Agenda 21
scope note: Rion ympäristö- ja kehityskonferenssin v. 1992 hyväksymä asiakirja, joka sisältää ympäristöä ja kehitystä koskevan toimintaohjelman

Local Agenda 21
type: Concept
preferred label: Paikallisagenda 21 @fi
related: Agenda 21