manors
type: Concept
preferred label: herrgårdar @sv
preferred label: kartanot @fi
narrower: Kirkniemi manor

Kirkniemi manor
type: Concept
broader: manors
scope note: Kartano Lohjalla (aik. Lohjan kunnassa). Kylää tarkoitettaessa käytä Lohja -- Kirkniemi
in scheme: conceptscheme
preferred label: Kirkniemi @fi