roll i anslutning till ideologisk grupp
type: Concept
preferred label: role related to ideological group @en
preferred label: aatteelliseen ryhmään liittyvä rooli @fi
narrower: konstitutionella

konstitutionella
type: Concept
source: Kielitoimiston sanakirja
related: autonoma tiden
broader: roll i anslutning till ideologisk grupp
in scheme: conceptscheme
preferred label: perustuslailliset @fi
comment: perustuslaillisen hallitusmuodon kannattaja, Suomessa vars. 1899 alkaneen ensimmäisen sortokauden aikaisista passiivisen vastarinnan kannattajista

autonoma tiden
type: Concept
preferred label: era of autonomy, history of finland @en
preferred label: autonomian aika @fi
related: konstitutionella