statens lokalförvaltning
type: Concept
preferred label: state local government @en
preferred label: valtion paikallishallinto @fi
related: härader

härader
type: Concept
related: statens lokalförvaltning
in scheme: conceptscheme
part of: statens lokalförvaltning
preferred label: jurisdictional districts @en
preferred label: kihlakunnat @fi
scope note: Inom den statliga lokalförvaltningen följer häraderna efter länen. En härad var ursprungligen en socken och senare blev den bla. en domares tjänsteområde. Mellan 1945-1996 sköttes folkbok- föringen i häraderna. Från och med 1.12.1996 är den statliga lokalförvaltningen ordnad härads- vis. Antalet härader är 90.
scope note: Lääniä pienempi valtion paikallisalue. Kihlakunta on alkuaan vastannut pitäjää, myöhemmin se on ollut mm. tuomarin virka-alue. Vuodesta 1945 vuoteen 1996 kihlakunta on ollut henkikirjoittajan toimialue. 1.12.1996 lähtien paikallishallinto on järjestetty kihlakunnittain, joita on 90
broader: förvaltningsområden

förvaltningsområden
type: Concept
preferred label: administrative areas @en
preferred label: hallintoalueet @fi
narrower: härader