groups
type: Concept
preferred label: grupper @sv
preferred label: ryhmät @fi
narrower: partners in a company

fishing corporations
type: Concept
preferred label: fiskeandelslag @sv
preferred label: kalastuskunnat @fi
related: partners in a company

partners in a company
type: Concept
preferred label: delägarlag @sv
preferred label: osakaskunnat @fi
source: Lähde: Yhteisaluelaki
in scheme: conceptscheme
broader: groups
related: fishing corporations
scope note: Yhteisen alueen tai yhteisen erityisen etuuden osakkaita ovat osakaskiinteistöjen omistajat. Osakkaat muodostavat osakaskunnan. Kalastuslaissa (286/1982) tarkoitettuna kalastuskuntana toimii tämän lain mukainen osakaskunta