DNA-sirut
type: Concept
preferred label: dna microarrays @en
preferred label: DNA-chips @sv
comment: Alusta, johon sijoitetaan tutkittavaksi ja tunnistettavaksi jopa kymmeniä tuhansia erilaisia DNA-paloja (geenejä).
source: Biotekniikan sanasto
broader: tekninen objekti
alternative label: DNA-lastut
in scheme: conceptscheme

tekninen objekti
type: Concept
preferred label: tekniskt objekt @sv
preferred label: technical object @en
narrower: DNA-sirut