järjestäminen
type: Concept
preferred label: arrangering @sv
preferred label: arranging @en
related: organisointi
in scheme: conceptscheme
source: Suomen kielen perussanakirja
comment: 1) panna tiettyyn tai säännölliseeen järjestykseen; 2) saattaa johonkin (asianmukaiseen, oikeaan) kuntoon; toteuttaa järjestelmällisesti; 3) ennalta suunnitella tai sopia, ohjailla jokin asia haluttuun suuntaan; 4) panna toimeen; 5) hankkia, toimittaa, hommata
broader: järjestävä muuttaminen

organisointi
type: Concept
preferred label: organisering @sv
preferred label: organisation @en
related: järjestäminen

järjestävä muuttaminen
type: Concept
preferred label: organiserande förändring @sv
preferred label: change by organizing @en
narrower: järjestäminen