publikationer
type: Concept
preferred label: julkaisut @fi
preferred label: publications @en
narrower: almanackor

almanackor
type: Concept
preferred label: almanakat @fi
preferred label: almanacs @en
scope note: Förteckning över kalendern, d v s årets dagar, veckor och månader, med uppgifter om helgdagar, namnsdagar, astronomiska händelser och andra fakta.
broader: publikationer
in scheme: conceptscheme
related: kalendrar

kalendrar
type: Concept
preferred label: calendars @en
preferred label: kalenterit @fi
related: almanackor