lagberedning
type: Concept
preferred label: preparation of legislation @en
preferred label: säädösvalmistelu @fi
broader: förberedelse

informationsrelaterat skapande
type: Concept
preferred label: creation related to information @en
preferred label: tiedollinen luonti @fi
narrower: förberedelse

förberedelse
type: Concept
in scheme: conceptscheme
narrower: lagberedning
preferred label: preparation, legislation @en
preferred label: valmistelu @fi
broader: informationsrelaterat skapande
comment: 1) tehdä alustavia töitä, suorittaa ennakkotoimenpiteitä jotakin varten, jonkin varalta; 2) jonkin esineen, tuotteen tms. tarkoituksellisesta aikaansaamisesta
source: Suomen kielen perussanakirja