painopiste
type: Concept
comment: piste johon kappaleen kaikkiin osasiin vaikuttavien painovoimien resultantin voidaan ajatella vaikuttavan
in scheme: conceptscheme
preferred label: centre of gravity @en
preferred label: tyngdpunkt @sv
broader: fyysiset ominaisuudet
alternative label: massakeskipiste
source: Kielitoimiston sanakirja

fyysiset ominaisuudet
type: Concept
preferred label: physical qualities @en
preferred label: fysiska egenskaper @sv
narrower: painopiste