strider
type: Concept
preferred label: battles @en
preferred label: taistelut @fi
narrower: slaget vid Olhava

slaget vid Olhava
type: Concept
broader: strider
scope note: Suomalaisten ja saksalaisten joukkojen välinen taistelu Iin Olhavassa 29.9.1944
related: Lapplandskriget
in scheme: conceptscheme
preferred label: Olhavan taistelu @fi

Lapplandskriget
type: Concept
preferred label: Lapin sota @fi
preferred label: war of lapland @en
related: slaget vid Olhava