dopamin
type: Concept
broader: katekolamin
scope note: Dopasta dekarboksylaation avulla muodostunut keskushermoston välittäjäaine (noradrenaliinin ja adrenaliinin esiaste), jota käytetään myös verenkiertolääkkeenä
in scheme: conceptscheme
preferred label: dopamine @en
preferred label: dopamiini @fi

katekolamin
type: Concept
preferred label: catecholamine @en
preferred label: katekolamiini @fi
narrower: dopamin