cultural historical buildings
type: Concept
preferred label: kulturhistoriska byggnader @sv
preferred label: kulttuurihistorialliset rakennukset @fi
narrower: Villa Kleineh

official residences
type: Concept
preferred label: tjänstebostäder @sv
preferred label: virka-asunnot @fi
narrower: Villa Kleineh

Villa Kleineh
type: Concept
broader: official residences
broader: cultural historical buildings
scope note: Kulttuurihistoriallinen rakennus Helsingissä, vuodesta 1998 lähtien Alankomaiden suurlähettilään virka-asunto
in scheme: conceptscheme