kulutus ja käyttö
type: Concept
preferred label: konsumtion och användning @sv
preferred label: consumption and usage @en
narrower: sovitus (koettaminen)

sovitus (koettaminen)
type: Concept
alternative label: sovitus
comment: koettaa asustetta tms. sen (koon) sopivuuden, istuvuuden toteamiseksi
in scheme: conceptscheme
broader: kulutus ja käyttö
preferred label: fitting (clothes) @en
preferred label: provande (kläder) @sv
source: Kielitoimiston sanakirja