skenbenet
type: Concept
broader: rörelseorganen
preferred label: sääriluu @fi
preferred label: tibia @en
comment: säären kahdesta luusta paksumpi ja lähes koko kuorman kantava luu, joka niveltyy yläpäästään reisiluuhun ja alapäästään telaluuhun
in scheme: conceptscheme
source: MOT Lääketiede 2.0a
part of: skelettet

rörelseorganen
type: Concept
preferred label: musculoskeletal system @en
preferred label: tuki- ja liikuntaelimet @fi
narrower: skenbenet

skelettet
type: Concept
preferred label: skeletal structure @en
preferred label: luusto @fi