mysticism
type: Concept
preferred label: mystik @sv
preferred label: mystiikka @fi
narrower: hesychasm

hesychasm
type: Concept
broader: mysticism
scope note: Ortodoksisessa kirkossa mystiikan laji, jossa samaa rukous- ta kerraten pyritään sisäiseen puhdistautumiseen ja yhtey- teen Jumalan kanssa
in scheme: conceptscheme
preferred label: hesykasmi @fi