purkaminen (osiin)
type: Concept
preferred label: dismantling @en
preferred label: rivning @sv
related: hajotus

toisenlaiseksi muuttaminen
type: Concept
preferred label: förvandling @sv
preferred label: alteration @en
narrower: hajotus

hajotus
type: Concept
related: purkaminen (osiin)
alternative label: hajottaminen
preferred label: disruption @en
preferred label: sönderdelning @sv
in scheme: conceptscheme
comment: 1) särkeä, rikkoa, pirstoa, murskata, tuhota, hävittää; 2) saattaa erilleen, jakaa osiksi; purkaa
broader: toisenlaiseksi muuttaminen
source: Suomen kielen perussanakirja