förvållande
type: Concept
preferred label: negligence @en
preferred label: tuottamus @fi
narrower: dödsvållande
comment: rikoksen tekeminen t. vahingon aiheuttaminen huolimattomuudella t. varomattomuudella
in scheme: conceptscheme
broader: förvandling
source: Kielitoimiston sanakirja

dödsvållande
type: Concept
preferred label: negligent manslaughter @en
preferred label: kuolemantuottamus @fi
broader: förvållande

förvandling
type: Concept
preferred label: alteration @en
preferred label: toisenlaiseksi muuttaminen @fi
narrower: förvållande