tilat (rakennetut)
type: Concept
preferred label: premises @en
narrower: asukastilat

asukastilat
type: Concept
broader: tilat (rakennetut)
preferred label: resident accommodations @en
preferred label: gemensamma utrymmen @sv
in scheme: conceptscheme
alternative label: asukastalot
scope note: yhteistilat +asukastilat = gemensamma utrymmen @sv

tilat käyttötarkoituksen mukaan
type: Collection
member: asukastilat