uusinnat
type: Concept
preferred label: rebroadcasts @en
preferred label: repriser @sv
comment: 1) uusiminen; 2) uusintaesitys, -kilpailu tms.; 3) uusimisen tulos, uusittu laitos
broader: järjestetty tapahtuma
in scheme: conceptscheme
source: Suomen kielen perussanakirja

järjestetty tapahtuma
type: Concept
preferred label: arranged event @en
preferred label: ordnad händelse @sv
narrower: uusinnat