flamländska
type: Concept
scope note: Belgiassa puhuttavaa hollannin kieltä on kutsuttu flaamin kieleksi. Nimitys flaamin kieli tarkoittaa nykyään flaamien puhekieltä ja Flanderin murretta, jota kielitieteellisessä mielessä pidetään yhtenä etelähollannin murteena
scope note: Flamländska talas i Belgien och provinsen Flandern. Det officiella språket är nederländska och flamländska räknas som dialekt
related: nederländska
preferred label: flaamin kieli @fi
preferred label: flemish language @en
broader: germanska språk
in scheme: conceptscheme
source: Lähde: Kielikello 3/2000

nederländska
type: Concept
preferred label: dutch @en
preferred label: hollannin kieli @fi
related: flamländska

germanska språk
type: Concept
preferred label: germanic languages @en
preferred label: germaaniset kielet @fi
narrower: flamländska