hallintoelimet
type: Concept
preferred label: förvaltningsorgan @sv
preferred label: administrative bodies @en
narrower: tuomiokunnat (hallintoelimet)

tuomiokunnat (hallintoelimet)
type: Concept
alternative label: tuomiokunnat
preferred label: domsagor @sv
preferred label: judicial districts @en
comment: Tuomiokunta on kihlakunnantuomarin ja käräjätuomareiden virka-alue eli eräänlainen hallinnollinen yksikkö, jolla on oma kanslia. Tuomiokunnan kansliassa työskentelevät tuomiokunnan tuomarit, toimistohenkilökunta ja notaarit. Kansliassa suoritetaan asiakaspalvelua, otetaan vastaan ja annetaan asiakirjoja, suoritetaan pöytäkirjojen kokoonpanotyöt ynnä muuta sellaista.
in scheme: conceptscheme
broader: hallintoelimet
source: www.finlex.fi