spanska inbördeskriget
type: Concept
preferred label: Spanish Civil War @en
preferred label: Espanjan sisällissota @fi
broader: inbördeskrig

krig
type: Concept
preferred label: sodat @fi
preferred label: wars @en
narrower: inbördeskrig

inbördeskriget
type: Concept
preferred label: civil war @en
preferred label: kansalaissota @fi
broader: inbördeskrig

inbördeskrig
type: Concept
narrower: inbördeskriget
narrower: spanska inbördeskriget
scope note: Eri maiden sisällissodat indeksoidaan esim. sisällissodat -- Suomi -- 1918 ja/tai käyttämällä asiasanana sisällissodan nimeä esim. Pohjois-Amerikan sisällissota
scope note: Inbördeskrig i olika länder indexeras t.ex. inbördeskrig : Finland : 1918 och/eller genom att använda namnet på inbördeskriget som ämnesord; t.ex. amerikanska inbördeskriget
preferred label: civil wars @en
preferred label: sisällissodat @fi
alternative label: kansalaissodat @fi
alternative label: medborgarkrig
broader: krig
in scheme: conceptscheme