social movements
type: Concept
preferred label: sociala rörelser @sv
preferred label: sosiaaliset liikkeet @fi
narrower: True Love Waits campaign

religious movements
type: Concept
preferred label: uskonnolliset liikkeet @fi
preferred label: religiösa rörelser @sv
related: True Love Waits campaign

True Love Waits campaign
type: Concept
broader: social movements
scope note: Suomeen vuonna 1997 tullut amerikkalaisperäinen seksuaalieettinen nuortenliike. Liikkeen jäsenet pidättäytyvät esiaviollisista suhteista
related: religious movements
in scheme: conceptscheme
preferred label: Tosi rakkaus odottaa -liike @fi