autoimmuunisairaudet
type: Concept
broader: taudit
source: Lähde: Lääketieteen termit
scope note: Sairaus, joka johtuu immuunivasteen kohdentumisesta kehon omiin antigeeneihin
alternative label: autoimmuunitaudit
in scheme: conceptscheme
preferred label: auto-immune diseases @en

taudit
type: Concept
preferred label: illnesses @en
preferred label: sjukdomar @sv
narrower: autoimmuunisairaudet