marches
type: Concept
comment: tasajakoinen korosteisen rytminen sävellys, joka us. on tarkoitettu ohjaamaan marssimista
source: Kielitoimiston sanakirja
narrower: funeral marches
broader: compositions
preferred label: marscher @sv
preferred label: marssit @fi
in scheme: conceptscheme

funeral marches
type: Concept
preferred label: sorgmarscher @sv
preferred label: surumarssit @fi
broader: marches

compositions
type: Concept
preferred label: kompositioner @sv
preferred label: sävellykset @fi
narrower: marches