asema
type: Concept
preferred label: status @en
narrower: siviilisääty

siviilisääty
type: Concept
preferred label: marital status @en
preferred label: civilstånd @sv
in scheme: conceptscheme
related: perhesuhteet
source: Kielitoimiston sanakirja
comment: henkilön asema siinä suhteessa, onko hän naimaton, avioliitossa, leski vai eronnut
broader: asema

perhesuhteet
type: Concept
preferred label: family relations @en
preferred label: familjeförhållanden @sv
related: siviilisääty