avtal
type: Concept
preferred label: agreements @en
preferred label: sopimukset @fi
narrower: elektroniska avtal

elektroniska avtal
type: Concept
preferred label: electronic contracts @en
preferred label: sähköiset sopimukset @fi
related: elektroniska avtal

elektroniska avtal
type: Concept
related: elektroniska avtal
in scheme: conceptscheme
preferred label: electronic contracts @en
preferred label: elektroniset sopimukset @fi
scope note: Sähköisistä sopimuksista vuoteen 2004 asti käytetty nimitys
scope note: elektroniset sopimukset + sähköiset sopimukset = elektroniska avtal
broader: avtal