pakkotila
type: Concept
preferred label: nödsituation @sv
preferred label: state of necessity @en
related: itseapu
source: Kielitoimiston sanakirja
comment: tilanne jossa vaarasta selviäminen on mahdollista vain toisen etua t. oikeutta loukkaamalla
broader: yhteiskunnalliset ilmiöt
in scheme: conceptscheme

itseapu
type: Concept
preferred label: självhjälp @sv
preferred label: self-help @en
related: pakkotila

yhteiskunnalliset ilmiöt
type: Concept
preferred label: societal phenomena @en
narrower: pakkotila