rättsekonomi
type: Concept
preferred label: economics of law @en
preferred label: oikeustaloustiede @fi
narrower: brottekonomi

brottekonomi
type: Concept
broader: rättsekonomi
source: Lähde: www.rikosseuraamus.fi/23872.htm
scope note: Rikostaloustiede on tieteenala, jolla rikollisuuteen ja sen torjuntaan kohdistuvassa tutkimuksessa hyödynnetään taloustieteellistä argumentaatiota sekä menetelmiä
in scheme: conceptscheme
preferred label: economics of crime @en
preferred label: rikostaloustiede @fi