organisations (systems)
type: Concept
preferred label: organisaatiot @fi
preferred label: organisationer @sv
narrower: homes for unmarried mothers

homes for unmarried mothers
type: Concept
in scheme: conceptscheme
related: housing services
preferred label: mödrahem @sv
preferred label: ensikodit @fi
comment: sosiaalipalveluna järjestetty majoituspaikka raskaana oleville tai vasta synnyttäneille äideille ja heidän lapsilleen
broader: organisations (systems)
source: Sosiaaliturvan sanasto

housing services
type: Concept
preferred label: boendeservice @sv
preferred label: asumispalvelut @fi
related: homes for unmarried mothers