therapeutic control
type: Concept
broader: equilibrium
source: laakari.fi
comment: hoidolla saavutettu tilan vakaus, esim. diabetesta sairastavan potilaan verensokerin pysyminen viitetasolla
preferred label: vårdbalans @sv
preferred label: hoitotasapaino @fi
in scheme: conceptscheme

equilibrium
type: Concept
preferred label: jämvikt @sv
preferred label: tasapaino @fi
narrower: therapeutic control