metoder
type: Concept
preferred label: menetelmät @fi
preferred label: methods @en
narrower: Godly Play

Godly Play
type: Concept
broader: metoder
scope note: Uskontokasvatuksen menetelmä, jonka kehitti 1970-luvulla yhdysvaltalainen pastori Jerome W. Berryman
in scheme: conceptscheme