external properties
type: Concept
preferred label: yttre egenskaper @sv
preferred label: ulkoiset ominaisuudet @fi
narrower: life cycle

course of life
type: Concept
preferred label: elämänkaari @fi
preferred label: levnadslopp @sv
related: life cycle

life cycle
type: Concept
alternative label: life span
preferred label: livslängd @sv
preferred label: elinkaari @fi
broader: external properties
scope note: Tarkoittaa tuotteiden elinkaarta. Käyttäytymistieteiden yhteydessä käytä elämänkaari
scope note: Avser produkters livslängd. Inom beteendeveten- skaperna används levnadslopp @sv
related: course of life
in scheme: conceptscheme